RANDID,SEX,TOTCHOL,AGE,SYSBP,DIABP,CURSMOKE,CIGPDAY,BMI,DIABETES,BPMEDS,HEARTRTE,GLUCOSE,educ,PREVCHD,PREVAP,PREVMI,PREVSTRK,PREVHYP,TIME,PERIOD,HDLC,LDLC,DEATH,ANGINA,HOSPMI,MI_FCHD,ANYCHD,STROKE,CVD,HYPERTEN,TIMEAP,TIMEMI,TIMEMIFC,TIMECHD,TIMESTRK,TIMECVD,TIMEDTH,TIMEHYP
2448,1,195,39,106,70,0,0,26.97,0,0,80,77,4,0,0,0,0,0,0,1,,,0,0,1,1,1,0,1,0,8766,6438,6438,6438,8766,6438,8766,8766
2448,1,209,52,121,66,0,0,,0,0,69,92,4,0,0,0,0,0,4628,3,31,178,0,0,1,1,1,0,1,0,8766,6438,6438,6438,8766,6438,8766,8766
6238,2,250,46,121,81,0,0,28.73,0,0,95,76,2,0,0,0,0,0,0,1,,,0,0,0,0,0,0,0,0,8766,8766,8766,8766,8766,8766,8766,8766
6238,2,260,52,105,69.5,0,0,29.43,0,0,80,86,2,0,0,0,0,0,2156,2,,,0,0,0,0,0,0,0,0,8766,8766,8766,8766,8766,8766,8766,8766
6238,2,237,58,108,66,0,0,28.5,0,0,80,71,2,0,0,0,0,0,4344,3,54,141,0,0,0,0,0,0,0,0,8766,8766,8766,8766,8766,8766,8766,8766
9428,1,245,48,127.5,80,1,20,25.34,0,0,75,70,1,0,0,0,0,0,0,1,,,0,0,0,0,0,0,0,0,8766,8766,8766,8766,8766,8766,8766,8766
9428,1,283,54,141,89,1,30,25.34,0,0,75,87,1,0,0,0,0,0,2199,2,,,0,0,0,0,0,0,0,0,8766,8766,8766,8766,8766,8766,8766,8766
10552,2,225,61,150,95,1,30,28.58,0,0,65,103,3,0,0,0,0,1,0,1,,,1,0,0,0,0,1,1,1,2956,2956,2956,2956,2089,2089,2956,0
10552,2,232,67,183,109,1,20,30.18,0,0,60,89,3,0,0,0,0,1,1977,2,,,1,0,0,0,0,1,1,1,2956,2956,2956,2956,2089,2089,2956,0
11252,2,285,46,130,84,1,23,23.1,0,0,85,85,3,0,0,0,0,0,0,1,,,0,0,0,0,0,0,0,1,8766,8766,8766,8766,8766,8766,8766,4285
11252,2,343,51,109,77,1,30,23.48,0,0,90,72,3,0,0,0,0,0,2072,2,,,0,0,0,0,0,0,0,1,8766,8766,8766,8766,8766,8766,8766,4285
11252,2,,58,155,90,1,30,24.61,0,0,74,,3,0,0,0,0,1,4285,3,,,0,0,0,0,0,0,0,1,8766,8766,8766,8766,8766,8766,8766,4285
11263,2,228,43,180,110,0,0,30.3,0,0,77,99,2,0,0,0,0,1,0,1,,,0,0,0,1,1,0,1,1,8766,8766,5719,5719,8766,5719,8766,0
11263,2,230,49,177,102,0,0,31.36,0,1,120,86,2,0,0,0,0,1,2178,2,,,0,0,0,1,1,0,1,1,8766,8766,5719,5719,8766,5719,8766,0
11263,2,220,55,180,106,0,0,31.17,1,1,86,81,2,0,0,0,0,1,4351,3,46,135,0,0,0,1,1,0,1,1,8766,8766,5719,5719,8766,5719,8766,0
12629,2,205,63,138,71,0,0,33.11,0,0,60,85,1,0,0,0,0,0,0,1,,,0,1,0,0,1,0,0,1,373,8766,8766,373,8766,8766,8766,2212
12629,2,220,70,149,81,0,0,36.76,0,0,80,98,1,1,1,0,0,1,2212,2,,,0,1,0,0,1,0,0,1,373,8766,8766,373,8766,8766,8766,2212
12806,2,313,45,100,71,1,20,21.68,0,0,79,78,2,0,0,0,0,0,0,1,,,0,0,0,0,0,0,0,1,8766,8766,8766,8766,8766,8766,8766,8679
12806,2,,51,109.5,72.5,1,30,22.19,0,0,75,,2,0,0,0,0,0,2170,2,,,0,0,0,0,0,0,0,1,8766,8766,8766,8766,8766,8766,8766,8679
12806,2,320,57,110,46,1,30,22.02,0,0,75,87,2,0,0,0,0,0,4289,3,34,286,0,0,0,0,0,0,0,1,8766,8766,8766,8766,8766,8766,8766,8679
14367,1,260,52,141.5,89,0,0,26.36,0,0,76,79,1,0,0,0,0,1,0,1,,,0,0,0,0,0,0,0,1,8766,8766,8766,8766,8766,8766,8766,0
14367,1,292,58,132,90,0,0,25.39,0,0,85,81,1,0,0,0,0,1,2293,2,,,0,0,0,0,0,0,0,1,8766,8766,8766,8766,8766,8766,8766,0
14367,1,280,64,168,100,0,0,25.72,0,0,92,82,1,0,0,0,0,1,4438,3,44,236,0,0,0,0,0,0,0,1,8766,8766,8766,8766,8766,8766,8766,0
16365,1,225,43,162,107,1,30,23.61,0,0,93,88,1,0,0,0,0,1,0,1,,,0,0,0,0,0,0,0,1,8766,8766,8766,8766,8766,8766,8766,0
16365,1,258,49,147,102,0,0,27.5,0,1,75,74,1,0,0,0,0,1,2191,2,,,0,0,0,0,0,0,0,1,8766,8766,8766,8766,8766,8766,8766,0
16365,1,211,55,173,123,0,0,29.11,0,1,75,85,1,0,0,0,0,1,4368,3,48,163,0,0,0,0,0,0,0,1,8766,8766,8766,8766,8766,8766,8766,0
16799,2,254,50,133,76,0,0,22.91,0,0,75,76,1,0,0,0,0,0,0,1,,,0,0,0,0,0,0,0,0,8766,8766,8766,8766,8766,8766,8766,8766
16799,2,,56,127.5,70,0,0,20.3,0,0,60,73,1,0,0,0,0,0,2143,2,,,0,0,0,0,0,0,0,0,8766,8766,8766,8766,8766,8766,8766,8766
16799,2,291,62,120,70,0,0,21.98,0,,62,83,1,0,0,0,0,0,4431,3,60,217,0,0,0,0,0,0,0,0,8766,8766,8766,8766,8766,8766,8766,8766
19304,2,247,43,131,88,0,0,27.64,0,0,72,61,2,0,0,0,0,0,0,1,,,0,0,0,0,0,0,0,0,8766,8766,8766,8766,8766,8766,8766,8766
20375,1,294,46,142,94,1,15,26.31,0,0,98,64,1,0,0,0,0,1,0,1,,,0,0,0,0,0,0,0,1,8766,8766,8766,8766,8766,8766,8766,0
20375,1,288,52,165,92,1,10,26.44,0,0,105,71,1,0,0,0,0,1,2277,2,,,0,0,0,0,0,0,0,1,8766,8766,8766,8766,8766,8766,8766,0
23727,2,332,41,124,88,0,0,31.31,0,1,65,84,3,0,0,0,0,1,0,1,,,1,0,0,0,0,0,0,1,5592,5592,5592,5592,5592,5592,5592,0
23727,2,225,47,120,80,0,0,27.98,0,1,75,74,3,0,0,0,0,1,2287,2,,,1,0,0,0,0,0,0,1,5592,5592,5592,5592,5592,5592,5592,0
23727,2,159,53,124,78,0,0,26.62,0,0,68,135,3,0,0,0,0,1,4503,3,53,106,1,0,0,0,0,0,0,1,5592,5592,5592,5592,5592,5592,5592,0
24721,2,226,39,114,64,1,9,22.35,0,0,85,,2,0,0,0,0,0,0,1,,,1,0,0,0,0,0,0,1,6411,6411,6411,6411,6411,6411,6411,4408
24721,2,196,46,136,89,1,50,21.24,0,0,110,76,2,0,0,0,0,0,2268,2,,,1,0,0,0,0,0,0,1,6411,6411,6411,6411,6411,6411,6411,4408
24721,2,264,51,141,81,1,15,24.77,0,0,85,97,2,0,0,0,0,1,4408,3,58,206,1,0,0,0,0,0,0,1,6411,6411,6411,6411,6411,6411,6411,4408
30928,2,221,38,140,90,1,20,21.35,0,0,95,70,2,0,0,0,0,1,0,1,,,1,0,0,0,0,0,0,1,146,146,146,146,146,146,146,0
33077,1,232,48,138,90,1,10,22.37,0,0,64,72,3,0,0,0,0,1,0,1,,,0,0,0,0,0,0,0,1,8766,8766,8766,8766,8766,8766,8766,0
33077,1,222,54,139.5,82,1,6,21.76,0,0,70,,3,0,0,0,0,1,2165,2,,,0,0,0,0,0,0,0,1,8766,8766,8766,8766,8766,8766,8766,0
33077,1,215,60,144.5,80,1,10,22.96,0,0,57,91,3,0,0,0,0,1,4383,3,62,135,0,0,0,0,0,0,0,1,8766,8766,8766,8766,8766,8766,8766,0
33555,2,291,46,112,78,1,20,23.38,0,0,80,89,2,0,0,0,0,0,0,1,,,1,0,0,0,0,0,0,0,1442,1442,1442,1442,1442,1442,1442,1442
34689,2,195,38,122,84.5,1,5,23.24,0,0,75,78,2,0,0,0,0,0,0,1,,,0,0,0,0,0,0,0,1,8766,8766,8766,8766,8766,8766,8766,2157
34689,2,265,44,139,95,1,7,30.05,0,1,90,80,2,0,0,0,0,1,2157,2,,,0,0,0,0,0,0,0,1,8766,8766,8766,8766,8766,8766,8766,2157
34689,2,212,49,163,96,1,10,31.45,0,0,82,84,2,0,0,0,0,1,4289,3,40,172,0,0,0,0,0,0,0,1,8766,8766,8766,8766,8766,8766,8766,2157
36459,1,195,41,139,88,0,0,26.88,0,0,85,65,2,0,0,0,0,0,0,1,,,0,0,0,0,0,0,0,1,8766,8766,8766,8766,8766,8766,8766,1469
36459,1,201,47,160,101,0,0,26.28,0,0,90,69,2,0,0,0,0,1,2159,2,,,0,0,0,0,0,0,0,1,8766,8766,8766,8766,8766,8766,8766,1469
36459,1,162,53,152.5,101,0,0,26.43,0,0,105,78,2,0,0,0,0,1,4411,3,31,91,0,0,0,0,0,0,0,1,8766,8766,8766,8766,8766,8766,8766,1469
40435,2,190,42,108,70.5,1,30,21.59,0,0,72,85,2,0,0,0,0,0,0,1,,,0,0,0,0,0,0,0,1,8766,8766,8766,8766,8766,8766,8766,5933
40435,2,244,48,122,77.5,1,60,21.77,0,0,75,89,2,0,0,0,0,0,2198,2,,,0,0,0,0,0,0,0,1,8766,8766,8766,8766,8766,8766,8766,5933
40435,2,226,54,126,75,1,40,21.59,0,0,85,102,2,0,0,0,0,0,4372,3,84,142,0,0,0,0,0,0,0,1,8766,8766,8766,8766,8766,8766,8766,5933
43522,2,185,43,123.5,77.5,0,0,29.89,0,0,70,,1,0,0,0,0,0,0,1,,,0,0,0,0,0,0,0,1,8766,8766,8766,8766,8766,8766,8766,5226
43522,2,270,49,127,84,0,0,34.55,0,0,65,85,1,0,0,0,0,0,2225,2,,,0,0,0,0,0,0,0,1,8766,8766,8766,8766,8766,8766,8766,5226
43522,2,,55,129,76,0,0,35.71,0,0,76,,1,0,0,0,0,0,4403,3,,,0,0,0,0,0,0,0,1,8766,8766,8766,8766,8766,8766,8766,5226
43770,2,234,52,148,78,0,0,34.17,0,0,70,113,1,0,0,0,0,0,0,1,,,1,0,1,1,1,0,1,1,6410,6384,6384,6384,6410,6384,6410,723
43770,2,272,58,162,78,0,0,33.29,1,0,60,123,1,0,0,0,0,1,2198,2,,,1,0,1,1,1,0,1,1,6410,6384,6384,6384,6410,6384,6410,723
43770,2,283,64,159,69,0,0,32.93,1,0,70,230,1,0,0,0,0,1,4375,3,45,238,1,0,1,1,1,0,1,1,6410,6384,6384,6384,6410,6384,6410,723
45464,2,215,52,132,82,1,20,25.11,0,0,71,75,3,0,0,0,0,0,0,1,,,0,0,0,0,0,0,0,1,8766,8766,8766,8766,8766,8766,8766,2177
45464,2,256,58,151,86,1,20,22.73,0,0,80,93,3,0,0,0,0,1,2177,2,,,0,0,0,0,0,0,0,1,8766,8766,8766,8766,8766,8766,8766,2177
45464,2,236,64,150,89,1,20,24.01,0,0,90,80,3,0,0,0,0,1,4368,3,93,143,0,0,0,0,0,0,0,1,8766,8766,8766,8766,8766,8766,8766,2177
47561,1,270,44,137.5,90,1,30,21.96,0,0,75,83,2,0,0,0,0,1,0,1,,,0,0,0,0,0,0,0,1,8766,8766,8766,8766,8766,8766,8766,0
47561,1,300,50,134,88,1,35,23.81,0,0,80,82,2,0,0,0,0,1,2041,2,,,0,0,0,0,0,0,0,1,8766,8766,8766,8766,8766,8766,8766,0
47561,1,290,56,132,70,1,40,22.73,0,0,100,90,2,0,0,0,0,1,4071,3,54,236,0,0,0,0,0,0,0,1,8766,8766,8766,8766,8766,8766,8766,0
54224,1,294,47,102,68,1,20,24.18,0,0,62,66,4,0,0,0,0,0,0,1,,,1,0,1,1,1,0,1,0,430,430,430,430,430,430,430,430
55965,2,260,60,110,72.5,0,0,26.59,0,0,65,,1,0,0,0,0,0,0,1,,,0,1,0,0,1,0,0,1,8297,8766,8766,8297,8766,8766,8766,7951
55965,2,256,66,126,82,0,0,25.43,0,0,60,77,1,0,0,0,0,0,2214,2,,,0,1,0,0,1,0,0,1,8297,8766,8766,8297,8766,8766,8766,7951
55965,2,298,72,109,60,0,0,26.2,0,0,80,100,1,0,0,0,0,0,4438,3,38,260,0,1,0,0,1,0,0,1,8297,8766,8766,8297,8766,8766,8766,7951
63156,1,225,35,132,91,1,20,26.09,0,0,73,83,2,0,0,0,0,1,0,1,,,0,0,0,0,0,0,0,1,8766,8766,8766,8766,8766,8766,8766,0
63156,1,233,41,123,82,1,20,25.01,0,0,75,67,2,0,0,0,0,1,2099,2,,,0,0,0,0,0,0,0,1,8766,8766,8766,8766,8766,8766,8766,0
63156,1,240,47,131,90,0,0,26.77,0,0,70,76,2,0,0,0,0,1,4248,3,40,200,0,0,0,0,0,0,0,1,8766,8766,8766,8766,8766,8766,8766,0
63221,2,272,61,182,121,0,0,32.8,0,0,85,65,3,0,0,0,0,1,0,1,,,1,0,0,1,1,0,1,1,168,168,168,168,168,168,168,0
66472,2,247,60,130,88,0,0,30.36,0,0,72,74,1,0,0,0,0,0,0,1,,,1,0,0,0,0,1,1,1,8423,8423,8423,8423,8085,8085,8423,1463
66472,2,248,66,135,75,0,0,30.16,0,0,76,76,1,0,0,0,0,1,2174,2,,,1,0,0,0,0,1,1,1,8423,8423,8423,8423,8085,8085,8423,1463
66472,2,249,72,157,87,0,0,29.55,1,0,65,73,1,0,0,0,0,1,4347,3,78,171,1,0,0,0,0,1,1,1,8423,8423,8423,8423,8085,8085,8423,1463
67905,1,295,36,102,68,1,35,28.15,0,0,60,63,4,0,0,0,0,0,0,1,,,0,0,0,0,0,0,0,1,8766,8766,8766,8766,8766,8766,8766,2954
67905,1,292,42,126,90,1,35,29.84,0,0,55,65,4,0,0,0,0,0,2212,2,,,0,0,0,0,0,0,0,1,8766,8766,8766,8766,8766,8766,8766,2954
67905,1,300,48,125,83,0,0,34.34,0,0,58,96,4,0,0,0,0,1,4424,3,47,253,0,0,0,0,0,0,0,1,8766,8766,8766,8766,8766,8766,8766,2954
68194,1,226,43,115,85.5,1,43,27.57,0,0,75,75,4,0,0,0,0,0,0,1,,,0,0,0,0,0,0,0,1,8766,8766,8766,8766,8766,8766,8766,6199
68194,1,232,49,123,86,1,40,27.86,0,0,75,66,4,0,0,0,0,0,2198,2,,,0,0,0,0,0,0,0,1,8766,8766,8766,8766,8766,8766,8766,6199
68194,1,206,55,129,85,1,50,26.4,0,0,84,69,4,0,0,0,0,0,4374,3,47,159,0,0,0,0,0,0,0,1,8766,8766,8766,8766,8766,8766,8766,6199
68397,1,227,40,125,90,0,0,23.62,0,0,86,79,3,1,1,1,0,0,0,1,,,0,1,1,1,1,0,0,1,0,0,0,0,8766,8766,8766,785
68397,1,296,46,118,90,1,10,23.34,0,,60,78,3,1,1,1,0,1,2222,2,,,0,1,1,1,1,0,0,1,0,0,0,0,8766,8766,8766,785
68397,1,320,53,148,89,1,8,22.78,0,0,80,110,3,1,1,1,0,1,4564,3,42,278,0,1,1,1,1,0,0,1,0,0,0,0,8766,8766,8766,785
69134,2,209,59,150,85,0,0,20.77,0,0,90,88,1,0,0,0,0,1,0,1,,,1,0,0,0,0,1,1,1,1047,1047,1047,1047,724,724,1047,0
70948,1,175,61,134,82.5,1,5,18.59,0,0,72,75,,0,0,0,0,0,0,1,,,1,1,0,0,1,0,0,1,2577,6948,6948,2577,6948,6948,6948,1451
70948,1,207,67,133,74,1,20,17.65,0,0,75,74,,0,0,0,0,1,2224,2,,,1,1,0,0,1,0,0,1,2577,6948,6948,2577,6948,6948,6948,1451
70948,1,283,73,145,85,1,3,17.28,0,0,88,80,,1,1,0,0,1,4317,3,65,218,1,1,0,0,1,0,0,1,2577,6948,6948,2577,6948,6948,6948,1451
76273,1,235,62,125,74.5,0,0,25.9,0,0,65,73,1,1,1,0,0,0,0,1,,,1,1,0,0,1,0,0,0,0,1417,1417,0,1417,1417,1417,1417
77492,1,214,54,147,74,1,20,24.71,0,0,96,87,1,0,0,0,0,1,0,1,,,1,0,0,1,1,0,1,1,5839,5839,5839,5839,5839,5839,5839,0
77492,1,230,59,141,63,0,0,22.33,0,0,65,75,1,0,0,0,0,1,2132,2,,,1,0,0,1,1,0,1,1,5839,5839,5839,5839,5839,5839,5839,0
77492,1,199,65,180,82,1,20,21.3,0,,90,,1,0,0,0,0,1,4144,3,94,96,1,0,0,1,1,0,1,1,5839,5839,5839,5839,5839,5839,5839,0
82188,1,225,37,124.5,92.5,0,0,38.53,0,0,95,83,2,0,0,0,0,1,0,1,,,0,0,0,0,0,0,0,1,8766,8766,8766,8766,8766,8766,8766,0
82188,1,244,43,156,109,0,0,38.53,0,0,85,67,2,0,0,0,0,1,2163,2,,,0,0,0,0,0,0,0,1,8766,8766,8766,8766,8766,8766,8766,0
82188,1,226,49,190,123,0,0,45.43,0,1,100,73,2,0,0,0,0,1,4303,3,34,192,0,0,0,0,0,0,0,1,8766,8766,8766,8766,8766,8766,8766,0
82425,1,257,56,153.5,102,0,0,28.09,0,0,72,75,,0,0,0,0,0,0,1,,,0,0,0,0,0,1,1,1,8766,8766,8766,8766,7722,7722,8766,751
82425,1,281,61,177,107,0,0,29.86,0,0,75,77,,0,0,0,0,1,2163,2,,,0,0,0,0,0,1,1,1,8766,8766,8766,8766,7722,7722,8766,751
82425,1,226,67,157,95,0,0,29.86,0,0,88,99,,0,0,0,0,1,4338,3,61,165,0,0,0,0,0,1,1,1,8766,8766,8766,8766,7722,7722,8766,751
83398,1,178,52,160,98,0,0,40.11,1,0,75,225,1,0,0,0,0,1,0,1,,,1,0,0,0,0,1,1,1,6269,6269,6269,6269,5488,5488,6269,0
83398,1,155,58,173,90,0,0,36.88,1,0,72,200,1,0,0,0,0,1,2205,2,,,1,0,0,0,0,1,1,1,6269,6269,6269,6269,5488,5488,6269,0
83398,1,,64,205,90,0,0,36.55,1,1,77,,1,0,0,0,0,1,4291,3,,,1,0,0,0,0,1,1,1,6269,6269,6269,6269,5488,5488,6269,0
84815,2,233,42,153,101,1,1,28.93,0,0,60,90,1,0,0,0,0,1,0,1,,,0,0,0,0,0,1,1,1,8766,8766,8766,8766,8702,8702,8766,0
84815,2,242,48,155,106,1,4,29.29,0,0,60,,1,0,0,0,0,1,2240,2,,,0,0,0,0,0,1,1,1,8766,8766,8766,8766,8702,8702,8766,0
84815,2,246,54,202,111,1,3,26.63,0,0,63,80,1,0,0,0,0,1,4429,3,41,205,0,0,0,0,0,1,1,1,8766,8766,8766,8766,8702,8702,8766,0
87124,1,180,36,111,73,0,0,27.78,0,0,71,80,3,0,0,0,0,0,0,1,,,0,0,0,0,0,0,0,0,8766,8766,8766,8766,8766,8766,8766,8766
87124,1,205,42,112,80,0,0,28.08,0,0,65,81,3,0,0,0,0,0,2176,2,,,0,0,0,0,0,0,0,0,8766,8766,8766,8766,8766,8766,8766,8766
90705,2,243,43,116.5,80,1,10,26.87,0,0,68,78,2,0,0,0,0,0,0,1,,,0,0,0,0,0,0,0,0,8766,8766,8766,8766,8766,8766,8766,8766
90705,2,180,48,118.5,79,1,15,30.34,0,0,75,91,2,0,0,0,0,0,2086,2,,,0,0,0,0,0,0,0,0,8766,8766,8766,8766,8766,8766,8766,8766
90705,2,216,54,100,75,1,16,29.82,0,0,70,68,2,0,0,0,0,0,4185,3,30,186,0,0,0,0,0,0,0,0,8766,8766,8766,8766,8766,8766,8766,8766
94510,2,237,41,122,78,1,1,23.28,0,0,75,74,2,0,0,0,0,0,0,1,,,0,0,0,0,0,0,0,0,8766,8766,8766,8766,8766,8766,8766,8766
94510,2,236,47,117,82,1,1,23.65,0,0,85,92,2,0,0,0,0,0,2203,2,,,0,0,0,0,0,0,0,0,8766,8766,8766,8766,8766,8766,8766,8766
94510,2,293,53,127,77,1,3,25.68,0,0,90,115,2,0,0,0,0,0,4366,3,52,241,0,0,0,0,0,0,0,0,8766,8766,8766,8766,8766,8766,8766,8766
95148,2,,52,148,92,0,0,25.09,0,1,70,,1,0,0,0,0,1,0,1,,,1,1,1,1,1,0,1,1,3607,3607,3607,3607,6524,3607,6524,0
95148,2,268,58,135,75,0,0,26.55,0,1,75,105,1,0,0,0,0,1,2128,2,,,1,1,1,1,1,0,1,1,3607,3607,3607,3607,6524,3607,6524,0
95148,2,240,64,154,98,0,0,26.91,0,,70,,1,1,1,1,0,1,4192,3,46,168,1,1,1,1,1,0,1,1,3607,3607,3607,3607,6524,3607,6524,0
95182,1,195,54,132,83.5,0,0,26.21,0,0,75,100,2,0,0,0,0,0,0,1,,,0,1,0,0,1,0,1,1,6243,8766,8766,6243,8766,6243,8766,727
95182,1,198,60,133,77,0,0,25.58,0,0,80,74,2,0,0,0,0,1,2162,2,,,0,1,0,0,1,0,1,1,6243,8766,8766,6243,8766,6243,8766,727
95182,1,176,66,139,72,0,0,27,0,0,74,77,2,0,0,0,0,1,4284,3,26,150,0,1,0,0,1,0,1,1,6243,8766,8766,6243,8766,6243,8766,727
95541,2,311,53,206,92,0,0,21.51,1,1,76,215,3,0,0,0,0,1,0,1,,,1,0,0,0,0,0,0,1,2697,2697,2697,2697,2697,2697,2697,0
95541,2,281,59,160,80,0,0,22.52,1,1,80,269,3,0,0,0,0,1,2081,2,,,1,0,0,0,0,0,0,1,2697,2697,2697,2697,2697,2697,2697,0
97026,2,208,49,96,63,0,0,20.68,0,0,65,98,2,0,0,0,0,0,0,1,,,0,0,0,0,0,0,0,0,8766,8766,8766,8766,8766,8766,8766,8766
97026,2,242,55,112,70,0,0,20.64,0,0,75,107,2,0,0,0,0,0,2114,2,,,0,0,0,0,0,0,0,0,8766,8766,8766,8766,8766,8766,8766,8766
97026,2,206,61,112,80,0,0,21.96,0,,63,138,2,0,0,0,0,0,4263,3,84,102,0,0,0,0,0,0,0,0,8766,8766,8766,8766,8766,8766,8766,8766
97895,2,252,65,179.5,114,0,0,30.47,0,0,90,87,1,0,0,0,0,1,0,1,,,1,0,0,1,1,1,1,1,5973,5973,5973,5819,5735,5735,5973,0
97895,2,286,70,181,105,0,0,30.64,0,0,80,,1,0,0,0,0,1,2165,2,,,1,0,0,1,1,1,1,1,5973,5973,5973,5819,5735,5735,5973,0
97895,2,,77,215,105,0,0,29.76,0,0,73,61,1,0,0,0,0,1,4405,3,,,1,0,0,1,1,1,1,1,5973,5973,5973,5819,5735,5735,5973,0
98536,1,261,46,119,77.5,1,20,23.59,0,0,75,74,1,0,0,0,0,0,0,1,,,0,0,0,0,0,0,0,1,8766,8766,8766,8766,8766,8766,8766,6734
98536,1,248,52,124,80,1,20,23.45,0,0,75,71,1,0,0,0,0,0,2163,2,,,0,0,0,0,0,0,0,1,8766,8766,8766,8766,8766,8766,8766,6734
98536,1,241,58,135,70,1,30,25.68,0,0,90,93,1,0,0,0,0,0,4285,3,41,200,0,0,0,0,0,0,0,1,8766,8766,8766,8766,8766,8766,8766,6734
100722,2,179,63,116,69,1,40,22.15,0,0,95,75,2,0,0,0,0,0,0,1,,,1,0,0,0,0,0,0,0,1881,1881,1881,1881,1881,1881,1881,1881
101990,1,194,36,139,93,1,20,24.33,0,,80,62,3,0,0,0,0,1,0,1,,,1,1,1,1,1,0,1,1,5880,8312,8312,5745,8312,5745,8312,0
101990,1,248,43,152,105,1,30,25.27,0,0,70,86,3,0,0,0,0,1,2401,2,,,1,1,1,1,1,0,1,1,5880,8312,8312,5745,8312,5745,8312,0
101990,1,230,49,142,90.5,1,35,24.33,0,0,70,61,3,0,0,0,0,1,4521,3,30,200,1,1,1,1,1,0,1,1,5880,8312,8312,5745,8312,5745,8312,0
110542,2,267,63,156.5,92.5,1,3,27.1,0,0,60,79,1,0,0,0,0,1,0,1,,,1,0,0,0,0,0,0,1,3315,3315,3315,3315,3315,3315,3315,0
110542,2,290,70,198,105,1,3,26.93,0,1,65,76,1,0,0,0,0,1,2277,2,,,1,0,0,0,0,0,0,1,3315,3315,3315,3315,3315,3315,3315,0
111019,1,216,51,112,66,0,0,23.47,0,0,90,95,4,0,0,0,0,0,0,1,,,0,0,0,0,0,0,0,0,8766,8766,8766,8766,8766,8766,8766,8766
112297,2,237,47,130,78,1,20,19.66,0,0,80,75,2,0,0,0,0,0,0,1,,,0,0,0,0,0,0,0,1,8766,8766,8766,8766,8766,8766,8766,5977
112297,2,324,53,139,88.5,1,30,20.56,0,0,80,61,2,0,0,0,0,0,2155,2,,,0,0,0,0,0,0,0,1,8766,8766,8766,8766,8766,8766,8766,5977
112297,2,251,59,132,77,1,20,19.3,0,0,82,76,2,0,0,0,0,0,4433,3,53,197,0,0,0,0,0,0,0,1,8766,8766,8766,8766,8766,8766,8766,5977
112469,2,240,62,145,82.5,0,0,28.27,0,0,63,75,1,0,0,0,0,0,0,1,,,0,0,0,0,0,0,0,1,8766,8766,8766,8766,8766,8766,8766,1463
112469,2,240,68,133,81,0,0,27.72,0,0,63,74,1,0,0,0,0,1,2154,2,,,0,0,0,0,0,0,0,1,8766,8766,8766,8766,8766,8766,8766,1463
112469,2,224,74,125,68,0,0,27.35,0,0,80,109,1,0,0,0,0,1,4332,3,35,189,0,0,0,0,0,0,0,1,8766,8766,8766,8766,8766,8766,8766,1463
123622,2,209,39,115,75,1,20,22.54,0,0,90,,2,0,0,0,0,0,0,1,,,0,0,0,0,0,0,0,1,8766,8766,8766,8766,8766,8766,8766,8524
123622,2,276,45,115,73,1,20,23.46,0,0,95,80,2,0,0,0,0,0,2228,2,,,0,0,0,0,0,0,0,1,8766,8766,8766,8766,8766,8766,8766,8524
123622,2,241,51,145,85,1,20,25.66,0,0,96,102,2,0,0,0,0,0,4380,3,68,173,0,0,0,0,0,0,0,1,8766,8766,8766,8766,8766,8766,8766,8524
125413,2,250,46,116,71,1,10,20.35,0,0,88,94,1,0,0,0,0,0,0,1,,,0,0,0,0,0,0,0,1,8766,8766,8766,8766,8766,8766,8766,4373
125413,2,,53,130,76,1,10,21.14,0,0,85,,1,0,0,0,0,0,2240,2,,,0,0,0,0,0,0,0,1,8766,8766,8766,8766,8766,8766,8766,4373
125413,2,,58,147,70,1,8,21.33,0,0,95,,1,0,0,0,0,1,4373,3,,,0,0,0,0,0,0,0,1,8766,8766,8766,8766,8766,8766,8766,4373
126721,2,266,54,114,76,1,9,17.61,1,0,88,55,1,0,0,0,0,0,0,1,,,0,0,0,0,0,0,0,0,5818,5818,5818,5818,5818,5818,8766,5818
127109,1,255,49,143.5,81,1,2,25.65,0,0,75,80,1,0,0,0,0,1,0,1,,,0,0,0,0,0,0,0,1,8766,8766,8766,8766,8766,8766,8766,0
127109,1,296,55,133,85,0,0,25.95,0,0,70,83,1,0,0,0,0,1,2134,2,,,0,0,0,0,0,0,0,1,8766,8766,8766,8766,8766,8766,8766,0
127109,1,241,60,132,86,0,0,25.62,0,,63,,1,0,0,0,0,1,4197,3,47,172,0,0,0,0,0,0,0,1,8766,8766,8766,8766,8766,8766,8766,0
127196,1,185,44,115,69,0,0,22.29,0,0,65,82,2,0,0,0,0,0,0,1,,,1,1,1,1,1,0,1,0,5317,7100,7100,5317,7102,5317,7102,7102
127196,1,226,50,108,74,0,0,20.56,0,0,80,79,2,0,0,0,0,0,1914,2,,,1,1,1,1,1,0,1,0,5317,7100,7100,5317,7102,5317,7102,7102
127196,1,216,56,117,70,1,20,21.35,0,0,72,49,2,0,0,0,0,0,4070,3,42,174,1,1,1,1,1,0,1,0,5317,7100,7100,5317,7102,5317,7102,7102
134914,2,205,40,158,102,1,20,25.45,0,0,75,87,4,0,0,0,0,0,0,1,,,0,1,0,0,1,0,0,1,1102,8766,8766,1102,8766,8766,8766,742
134914,2,194,46,208,127,1,20,26,0,1,85,62,4,1,1,0,0,1,2219,2,,,0,1,0,0,1,0,0,1,1102,8766,8766,1102,8766,8766,8766,742
134914,2,180,52,195,107,1,40,22.36,0,1,68,75,4,1,1,0,0,1,4410,3,60,120,0,1,0,0,1,0,0,1,1102,8766,8766,1102,8766,8766,8766,742
147250,1,270,56,121,79,1,20,23.58,0,0,95,93,4,0,0,0,0,0,0,1,,,0,0,0,0,0,0,0,1,8766,8766,8766,8766,8766,8766,8766,5426
147250,1,303,62,120,74,1,30,22.45,0,0,80,70,4,0,0,0,0,0,2174,2,,,0,0,0,0,0,0,0,1,8766,8766,8766,8766,8766,8766,8766,5426
147250,1,229,68,145,77,1,20,23.09,0,0,72,83,4,0,0,0,0,0,4469,3,39,170,0,0,0,0,0,0,0,1,8766,8766,8766,8766,8766,8766,8766,5426
149386,2,254,67,157,89,0,0,24.25,0,0,60,74,1,0,0,0,0,1,0,1,,,1,0,0,0,0,0,0,1,5526,5526,5526,5526,5526,5526,5526,0
149386,2,277,73,180,80,0,0,23.67,0,0,68,62,1,0,0,0,0,1,2082,2,,,1,0,0,0,0,0,0,1,5526,5526,5526,5526,5526,5526,5526,0
149386,2,262,79,188,104,0,0,20.26,0,,61,82,1,0,0,0,0,1,4291,3,54,185,1,0,0,0,0,0,0,1,5526,5526,5526,5526,5526,5526,5526,0
151110,1,220,53,123.5,75,1,20,19.64,0,0,78,73,1,0,0,0,0,0,0,1,,,1,0,0,0,0,0,0,1,5276,5276,5276,5276,5276,5276,5276,4380
151110,1,239,59,129,78,1,10,21.68,0,0,73,82,1,0,0,0,0,0,2133,2,,,1,0,0,0,0,0,0,1,5276,5276,5276,5276,5276,5276,5276,4380
151110,1,276,65,148,84,0,0,19.64,0,,80,88,1,0,0,0,0,1,4380,3,39,189,1,0,0,0,0,0,0,1,5276,5276,5276,5276,5276,5276,5276,4380
153093,2,235,57,126.5,80,1,3,24.88,0,0,83,72,1,0,0,0,0,0,0,1,,,1,0,1,1,1,0,1,0,4875,4875,4875,4875,4875,4875,4875,4875
153093,2,232,63,122,64,1,10,27.26,0,0,80,104,1,0,0,0,0,0,2199,2,,,1,0,1,1,1,0,1,0,4875,4875,4875,4875,4875,4875,4875,4875
153093,2,236,69,125,74,1,20,22.49,1,0,90,103,1,0,0,0,0,0,4308,3,30,206,1,0,1,1,1,0,1,0,4875,4875,4875,4875,4875,4875,4875,4875
157585,1,220,57,136,84,0,0,26.84,0,0,75,64,1,0,0,0,0,0,0,1,,,1,0,1,1,1,0,1,1,1620,1620,1620,1620,1620,1620,1620,1472
160953,2,252,63,154,87,0,0,28.6,0,0,72,45,1,0,0,0,0,1,0,1,,,1,0,0,0,0,1,1,1,5572,5572,5572,5572,3599,3599,5572,0
160953,2,249,69,137,85.5,0,0,27.56,0,0,95,77,1,0,0,0,0,1,2191,2,,,1,0,0,0,0,1,1,1,5572,5572,5572,5572,3599,3599,5572,0
160953,2,246,75,153,78,0,0,25.31,0,0,110,83,1,0,0,0,1,1,4289,3,54,192,1,0,0,0,0,1,1,1,5572,5572,5572,5572,3599,3599,5572,0
162207,2,212,62,190,99,0,0,29.64,1,0,100,202,1,0,0,0,0,1,0,1,,,1,0,0,0,1,0,1,1,8406,8406,8406,5413,8406,5413,8406,0
162207,2,245,68,194,92,0,0,31.8,1,1,94,180,1,0,0,0,0,1,2190,2,,,1,0,0,0,1,0,1,1,8406,8406,8406,5413,8406,5413,8406,0
162207,2,194,74,206,106,0,0,31.45,1,,120,178,1,0,0,0,0,1,4277,3,59,121,1,0,0,0,1,0,1,1,8406,8406,8406,5413,8406,5413,8406,0
162837,1,223,38,107,73,1,20,23.01,0,0,65,78,1,0,0,0,0,0,0,1,,,0,0,0,0,0,0,0,0,8766,8766,8766,8766,8766,8766,8766,8766
162837,1,266,44,122,81,1,20,24.51,0,,70,63,1,0,0,0,0,0,2125,2,,,0,0,0,0,0,0,0,0,8766,8766,8766,8766,8766,8766,8766,8766
162837,1,238,50,113,75,1,10,23.35,0,0,90,89,1,0,0,0,0,0,4295,3,46,192,0,0,0,0,0,0,0,0,8766,8766,8766,8766,8766,8766,8766,8766
165891,2,300,47,112.5,60,1,20,20.13,0,0,76,83,2,0,0,0,0,0,0,1,,,0,0,0,0,0,0,0,1,8766,8766,8766,8766,8766,8766,8766,5186
165891,2,348,53,108,65,1,20,20.08,0,0,80,76,2,0,0,0,0,0,2156,2,,,0,0,0,0,0,0,0,1,8766,8766,8766,8766,8766,8766,8766,5186
165891,2,314,59,143,66,1,20,18.32,0,0,93,96,2,0,0,0,0,0,4379,3,61,237,0,0,0,0,0,0,0,1,8766,8766,8766,8766,8766,8766,8766,5186
168256,2,302,52,110,67.5,0,0,23.51,0,0,63,87,4,0,0,0,0,0,0,1,,,0,0,0,0,0,0,0,0,8766,8766,8766,8766,8766,8766,8766,8766
168256,2,301,59,127,83,0,0,23.51,0,0,60,69,4,0,0,0,0,0,2233,2,,,0,0,0,0,0,0,0,0,8766,8766,8766,8766,8766,8766,8766,8766
168256,2,272,64,116,66,0,0,23.18,0,0,77,74,4,0,0,0,0,0,4392,3,41,231,0,0,0,0,0,0,0,0,8766,8766,8766,8766,8766,8766,8766,8766
170881,2,248,63,164.5,76,0,0,29.35,0,0,70,,4,0,0,0,0,0,0,1,,,1,0,0,0,0,0,0,1,7078,7078,7078,7078,7078,7078,7078,834
170881,2,280,69,168,86,0,0,22.91,1,0,85,165,4,0,0,0,0,1,2294,2,,,1,0,0,0,0,0,0,1,7078,7078,7078,7078,7078,7078,7078,834
172770,1,175,42,116,72.5,1,10,28.61,0,0,63,95,3,0,0,0,0,0,0,1,,,0,0,0,0,0,0,0,0,8766,8766,8766,8766,8766,8766,8766,8766
172770,1,210,48,129,71,1,10,30.05,0,0,60,,3,0,0,0,0,0,2227,2,,,0,0,0,0,0,0,0,0,8766,8766,8766,8766,8766,8766,8766,8766
172770,1,213,54,122,77,1,10,31.06,0,0,60,83,3,0,0,0,0,0,4344,3,56,157,0,0,0,0,0,0,0,0,8766,8766,8766,8766,8766,8766,8766,8766
174973,2,200,37,119,79,0,0,33.29,0,0,67,87,,0,0,0,0,0,0,1,,,0,0,0,0,0,0,0,1,8766,8766,8766,8766,8766,8766,8766,8021
174973,2,206,42,130,80,1,3,37.51,0,0,70,83,,0,0,0,0,0,1865,2,,,0,0,0,0,0,0,0,1,8766,8766,8766,8766,8766,8766,8766,8021
174973,2,208,48,122,74,1,3,40.33,0,0,75,82,,0,0,0,0,0,4028,3,35,173,0,0,0,0,0,0,0,1,8766,8766,8766,8766,8766,8766,8766,8021
176705,2,189,41,150,106,1,20,33.8,0,0,85,75,1,0,0,0,0,1,0,1,,,0,0,0,0,0,0,0,1,8766,8766,8766,8766,8766,8766,8766,0
176705,2,194,47,165,115,1,20,30.32,0,0,60,79,1,0,0,0,0,1,2151,2,,,0,0,0,0,0,0,0,1,8766,8766,8766,8766,8766,8766,8766,0
176705,2,205,52,164,116,1,20,29.9,0,,72,,1,0,0,0,0,1,4242,3,47,137,0,0,0,0,0,0,0,1,8766,8766,8766,8766,8766,8766,8766,0
177761,2,221,44,110,76,1,10,22.16,0,0,64,83,2,0,0,0,0,0,0,1,,,0,0,0,0,0,0,0,0,2911,2911,2911,2911,2911,2911,8766,2911